Reaction Details
TargetNeuronal acetylcholine receptor subunit alpha-4/beta-2
LigandBDBM50081490
Substrate/Competitorn/a
Meas. Tech.ChEBML_142762
Ki 2.4±n/a nM
Citation Lin, NHAbreo, MAGunn, DELebold, SALee, ELWasicak, JTHettinger, AMDaanen, JFGarvey, DSCampbell, JESullivan, JPWilliams, MArneric, SP Structure-activity studies on a novel series of cholinergic channel activators based on a heteroaryl ether framework. Bioorg Med Chem Lett9:2747-52 (1999) Neuronal acetylcholine receptor subunit alpha-4/beta-2
Name:Neuronal acetylcholine receptor subunit alpha-4/beta-2
Type:n/a
Mol. Mass.:n/a
Description:n/a
Components:This complex has 0 components.
Component 1
Name:Neuronal acetylcholine receptor subunit alpha-4
Synonyms:ACHA4_RAT Cholinergic, Nicotinic Alpha4Beta2 Chrna4 Neuronal acetylcholine receptor (alpha4beta2 nAChR) Neuronal acetylcholine receptor subunit alpha 4 beta 2 | Neuronal acetylcholine receptor subunit alpha-4
Type:Enzyme
Mol. Mass.:70196.44
Organism:Rattus norvegicus (Rat)
Description:P09483
Residue:630
Component 2
Name:Neuronal acetylcholine receptor subunit beta-2
Synonyms:ACHB2_RAT Chrnb2 Neuronal acetylcholine receptor non-alpha-1 chain
Type:Enzyme
Mol. Mass.:56910.32
Organism:Rattus norvegicus (Rat)
Description:P12390
Residue:500
BDBM50081490
NameBDBM50081490
Synonyms:5-((S)-1-Methyl-pyrrolidin-2-ylmethoxy)-pyrimidine | CHEMBL329682
TypeSmall organic molecule
Emp. Form.C10H15N3O
Mol. Mass.193.2456
SMILESCN1CCC[C@H]1COc1cncnc1