Reaction Details
TargetBile salt-activated lipase
LigandBDBM50081699
Substrate/Competitorn/a
Meas. Tech.ChEMBL_48915 (CHEMBL660745)
Ki 2300±n/a nM
Citation Deck, LMBaca, MLSalas, SLHunsaker, LAVander Jagt, DL 3-Alkyl-6-chloro-2-pyrones: selective inhibitors of pancreatic cholesterol esterase. J Med Chem42:4250-6 (1999) Bile salt-activated lipase
Name:Bile salt-activated lipase
Type:PROTEIN
Mol. Mass.:79308.99
Organism:Homo sapiens (Human)
Description:ChEMBL_512655
Residue:753
BDBM50081699
NameBDBM50081699
Synonyms:6-Chloro-3-cyclohexyl-pyran-2-one | CHEMBL134790
TypeSmall organic molecule
Emp. Form.C11H13ClO2
Mol. Mass.212.673
SMILESClc1ccc(C2CCCCC2)c(=O)o1