Reaction Details
TargetTyrosine--tRNA ligase, cytoplasmic
LigandBDBM50081834
Substrate/Competitorn/a
Meas. Tech.ChEBML_211021
IC50 900±n/a nM
Citation Jarvest, RLBerge, JMHouge-Frydrych, CSJanson, CMensah, LMO'Hanlon, PJPope, ASaldanha, AQiu, X Interaction of tyrosyl aryl dipeptides with S. aureus tyrosyl tRNA synthetase: inhibition and crystal structure of a complex. Bioorg Med Chem Lett9:2859-62 (1999) Tyrosine--tRNA ligase, cytoplasmic
Name:Tyrosine--tRNA ligase, cytoplasmic
Type:PROTEIN
Mol. Mass.:59145.78
Organism:Homo sapiens (Human)
Description:ChEMBL_211030
Residue:528
BDBM50081834
NameBDBM50081834
Synonyms:(S)-[(S)-2-Amino-3-(4-hydroxy-phenyl)-propionylamino]-phenyl-acetic acid | CHEMBL98622
TypeSmall organic molecule
Emp. Form.C17H18N2O4
Mol. Mass.314.3358
SMILESN[C@@H](Cc1ccc(O)cc1)C(=O)N[C@H](C(O)=O)c1ccccc1