Reaction Details
TargetProstaglandin G/H synthase 2
LigandBDBM22369
Substrate/Competitorn/a
Meas. Tech.ChEMBL_51705 (CHEMBL665720)
IC50 500±n/a nM
Citation Li, CSBlack, WCBrideau, CChan, CCCharleson, SCromlish, WAClaveau, DGauthier, JYGordon, RGreig, GGrimm, EGuay, JLau, CKRiendeau, DThérien, MVisco, DMWong, EXu, LPrasit, P A new structural variation on the methanesulfonylphenyl class of selective cyclooxygenase-2 inhibitors. Bioorg Med Chem Lett9:3181-6 (1999) Prostaglandin G/H synthase 2
Name:Prostaglandin G/H synthase 2
Type:Enzyme
Mol. Mass.:69003.89
Organism:Homo sapiens (Human)
Description:Recombinant Cox-2 provided by Cayman (Cayman Chemical Co.,Ann Arbor, MI).
Residue:604
BDBM22369
NameBDBM22369
Synonyms:4-(4-methanesulfonylphenyl)-3-phenyl-2,5-dihydrofuran-2-one MK 0966 US11478464, Compound Rofecoxib | US11786535, Compound Rofecoxib
TypeSmall organic molecule
Emp. Form.C17H14O4S
Mol. Mass.314.356
SMILESCS(=O)(=O)c1ccc(cc1)C1=C(C(=O)OC1)c1ccccc1