Reaction Details
Target5-hydroxytryptamine receptor 1B
LigandBDBM50083131
Substrate/Competitorn/a
Meas. Tech.ChEMBL_1614 (CHEMBL616639)
IC50 6.2±n/a nM
Citation Russell, MGMatassa, VGPengilley, RRvan Niel, MBSohal, BWatt, APHitzel, LBeer, MSStanton, JABroughton, HBCastro, JL 3-[3-(Piperidin-1-yl)propyl]indoles as highly selective h5-HT(1D) receptor agonists. J Med Chem42:4981-5001 (2000) 5-hydroxytryptamine receptor 1B
Name:5-hydroxytryptamine receptor 1B
Type:G Protein-Coupled Receptor (GPCR)
Mol. Mass.:43579.17
Organism:Homo sapiens (Human)
Description:Receptor binding assays were performed using human clone stably expressed in CHO cells
Residue:390
BDBM50083131
NameBDBM50083131
Synonyms:1-Methyl-3-phenyl-1-{1-[3-(5-[1,2,4]triazol-4-yl-1H-indol-3-yl)-propyl]-piperidin-4-ylmethyl}-urea | CHEMBL147148
TypeSmall organic molecule
Emp. Form.C27H33N7O
Mol. Mass.471.5972
SMILESCN(CC1CCN(CCCc2c[nH]c3ccc(cc23)-n2cnnc2)CC1)C(=O)Nc1ccccc1