Reaction Details
Target5-hydroxytryptamine receptor 6
LigandBDBM50060429
Substrate/Competitorn/a
Meas. Tech.ChEMBL_3655 (CHEMBL620791)
IC50>10000±n/a nM
Citation Russell, MGMatassa, VGPengilley, RRvan Niel, MBSohal, BWatt, APHitzel, LBeer, MSStanton, JABroughton, HBCastro, JL 3-[3-(Piperidin-1-yl)propyl]indoles as highly selective h5-HT(1D) receptor agonists. J Med Chem42:4981-5001 (2000) 5-hydroxytryptamine receptor 6
Name:5-hydroxytryptamine receptor 6
Type:Enzyme Catalytic Domain
Mol. Mass.:46945.51
Organism:RAT
Description:5-HT6 HTR6 RAT::P31388
Residue:436
BDBM50060429
NameBDBM50060429
Synonyms:(R)-2-(4-Fluoro-phenyl)-2-{1-[3-(5-[1,2,4]triazol-4-yl-1H-indol-3-yl)-propyl]-piperidin-4-ylamino}-ethanol | CHEMBL313714
TypeSmall organic molecule
Emp. Form.C26H31FN6O
Mol. Mass.462.5623
SMILESOC[C@H](NC1CCN(CCCc2c[nH]c3ccc(cc23)-n2cnnc2)CC1)c1ccc(F)cc1