Reaction Details
Target5-hydroxytryptamine receptor 1D
LigandBDBM50083133
Substrate/Competitorn/a
Meas. Tech.ChEMBL_1700 (CHEMBL616907)
IC50 3±n/a nM
Citation Russell, MGMatassa, VGPengilley, RRvan Niel, MBSohal, BWatt, APHitzel, LBeer, MSStanton, JABroughton, HBCastro, JL 3-[3-(Piperidin-1-yl)propyl]indoles as highly selective h5-HT(1D) receptor agonists. J Med Chem42:4981-5001 (2000) 5-hydroxytryptamine receptor 1D
Name:5-hydroxytryptamine receptor 1D
Type:G Protein-Coupled Receptor (GPCR)
Mol. Mass.:41920.63
Organism:Homo sapiens (Human)
Description:Receptor binding assays were performed using human clone stably expressed in CHO cells.
Residue:377
BDBM50083133
NameBDBM50083133
Synonyms:CHEMBL146335 | N-[4-({1-[3-(5-[1,2,4]Triazol-4-yl-1H-indol-3-yl)-propyl]-piperidin-4-ylamino}-methyl)-phenyl]-acetamide
TypeSmall organic molecule
Emp. Form.C27H33N7O
Mol. Mass.471.5972
SMILESCC(=O)Nc1ccc(CNC2CCN(CCCc3c[nH]c4ccc(cc34)-n3cnnc3)CC2)cc1