Reaction Details
Target5-hydroxytryptamine receptor 1D
LigandBDBM50083118
Substrate/Competitorn/a
Meas. Tech.ChEMBL_1700 (CHEMBL616907)
IC50 1.6±n/a nM
Citation Russell, MGMatassa, VGPengilley, RRvan Niel, MBSohal, BWatt, APHitzel, LBeer, MSStanton, JABroughton, HBCastro, JL 3-[3-(Piperidin-1-yl)propyl]indoles as highly selective h5-HT(1D) receptor agonists. J Med Chem42:4981-5001 (2000) 5-hydroxytryptamine receptor 1D
Name:5-hydroxytryptamine receptor 1D
Type:G Protein-Coupled Receptor (GPCR)
Mol. Mass.:41920.63
Organism:Homo sapiens (Human)
Description:Receptor binding assays were performed using human clone stably expressed in CHO cells.
Residue:377
BDBM50083118
NameBDBM50083118
Synonyms:Benzyl-{1-[3-(5-[1,2,4]triazol-4-yl-1H-indol-3-yl)-propyl]-piperidin-4-ylmethyl}-amine | CHEMBL143893
TypeSmall organic molecule
Emp. Form.C26H32N6
Mol. Mass.428.5725
SMILESC(CN1CCC(CNCc2ccccc2)CC1)Cc1c[nH]c2ccc(cc12)-n1cnnc1