Reaction Details
Target5-hydroxytryptamine receptor 1B
LigandBDBM50083137
Substrate/Competitorn/a
Meas. Tech.ChEMBL_1614 (CHEMBL616639)
IC50 100±n/a nM
Citation Russell, MGMatassa, VGPengilley, RRvan Niel, MBSohal, BWatt, APHitzel, LBeer, MSStanton, JABroughton, HBCastro, JL 3-[3-(Piperidin-1-yl)propyl]indoles as highly selective h5-HT(1D) receptor agonists. J Med Chem42:4981-5001 (2000) 5-hydroxytryptamine receptor 1B
Name:5-hydroxytryptamine receptor 1B
Type:G Protein-Coupled Receptor (GPCR)
Mol. Mass.:43579.17
Organism:Homo sapiens (Human)
Description:Receptor binding assays were performed using human clone stably expressed in CHO cells
Residue:390
BDBM50083137
NameBDBM50083137
Synonyms:(R)-2-{1-[3-(5-Imidazol-1-yl-1H-indol-3-yl)-propyl]-piperidin-4-ylamino}-2-phenyl-ethanol | CHEMBL434125
TypeSmall organic molecule
Emp. Form.C27H33N5O
Mol. Mass.443.5838
SMILESOC[C@H](NC1CCN(CCCc2c[nH]c3ccc(cc23)-n2ccnc2)CC1)c1ccccc1