Reaction Details
Target5-hydroxytryptamine receptor 1D
LigandBDBM50060429
Substrate/Competitorn/a
Meas. Tech.ChEMBL_1676 (CHEMBL616666)
EC50 0.8±n/a nM
Citation Russell, MGMatassa, VGPengilley, RRvan Niel, MBSohal, BWatt, APHitzel, LBeer, MSStanton, JABroughton, HBCastro, JL 3-[3-(Piperidin-1-yl)propyl]indoles as highly selective h5-HT(1D) receptor agonists. J Med Chem42:4981-5001 (2000) 5-hydroxytryptamine receptor 1D
Name:5-hydroxytryptamine receptor 1D
Type:G Protein-Coupled Receptor (GPCR)
Mol. Mass.:41920.63
Organism:Homo sapiens (Human)
Description:Receptor binding assays were performed using human clone stably expressed in CHO cells.
Residue:377
BDBM50060429
NameBDBM50060429
Synonyms:(R)-2-(4-Fluoro-phenyl)-2-{1-[3-(5-[1,2,4]triazol-4-yl-1H-indol-3-yl)-propyl]-piperidin-4-ylamino}-ethanol | CHEMBL313714
TypeSmall organic molecule
Emp. Form.C26H31FN6O
Mol. Mass.462.5623
SMILESOC[C@H](NC1CCN(CCCc2c[nH]c3ccc(cc23)-n2cnnc2)CC1)c1ccc(F)cc1