Reaction Details
Target5-hydroxytryptamine receptor 1B
LigandBDBM50083105
Substrate/Competitorn/a
Meas. Tech.ChEMBL_1614 (CHEMBL616639)
IC50 3.3±n/a nM
Citation Russell, MGMatassa, VGPengilley, RRvan Niel, MBSohal, BWatt, APHitzel, LBeer, MSStanton, JABroughton, HBCastro, JL 3-[3-(Piperidin-1-yl)propyl]indoles as highly selective h5-HT(1D) receptor agonists. J Med Chem42:4981-5001 (2000) 5-hydroxytryptamine receptor 1B
Name:5-hydroxytryptamine receptor 1B
Type:G Protein-Coupled Receptor (GPCR)
Mol. Mass.:43579.17
Organism:Homo sapiens (Human)
Description:Receptor binding assays were performed using human clone stably expressed in CHO cells
Residue:390
BDBM50083105
NameBDBM50083105
Synonyms:CHEMBL358072 | Pyridin-2-yl-{1-[3-(5-[1,2,4]triazol-4-yl-1H-indol-3-yl)-propyl]-piperidin-4-ylmethyl}-amine
TypeSmall organic molecule
Emp. Form.C24H29N7
Mol. Mass.415.534
SMILESC(CN1CCC(CNc2ccccn2)CC1)Cc1c[nH]c2ccc(cc12)-n1cnnc1