Reaction Details
TargetSodium-dependent dopamine transporter
LigandBDBM22167
Substrate/Competitorn/a
Meas. Tech.ChEMBL_62337 (CHEMBL878290)
Ki 3.7±n/a nM
Citation Lewis, DBMatecka, DZhang, YHsin, LWDersch, CMStafford, DGlowa, JRRothman, RBRice, KC Oxygenated analogues of 1-[2-(Diphenylmethoxy)ethyl]- and 1-[2-[Bis(4-fluorophenyl)methoxy]ethyl]-4-(3-phenylpropyl)piperazines (GBR 12935 and GBR 12909) as potential extended-action cocaine-abuse therapeutic agents. J Med Chem42:5029-42 (2000) Sodium-dependent dopamine transporter
Name:Sodium-dependent dopamine transporter
Type:Multi-pass membrane protein
Mol. Mass.:68749.45
Organism:Rattus norvegicus (rat)
Description:P23977
Residue:619
BDBM22167
NameBDBM22167
Synonyms:1-[2-(diphenylmethoxy)ethyl]-4-(3-phenylpropyl)piperazine CHEMBL434080 GBR-12935
TypeSmall organic molecule
Emp. Form.C28H34N2O
Mol. Mass.414.5824
SMILESC(CN1CCN(CCOC(c2ccccc2)c2ccccc2)CC1)Cc1ccccc1