Reaction Details
TargetProthrombin
LigandBDBM50083547
Substrate/Competitorn/a
Meas. Tech.ChEBML_208899
Ki 23000±n/a nM
Citation Ono, SKuwahara, STakeuchi, MSakashita, HNaito, YKondo, T Syntheses and evaluation of amidinobenzofuran derivatives as tryptase inhibitors. Bioorg Med Chem Lett9:3285-90 (2000) Prothrombin
Name:Prothrombin
Type:Protein
Mol. Mass.:70029.57
Organism:Homo sapiens (Human)
Description:P00734
Residue:622
BDBM50083547
NameBDBM50083547
Synonyms:1,5-di(4-(5-amino(imino)methylbenzo[b]furan-2-ylcarbonyl)hexahydro-1-pyrazinyl)-1,5-pentanedione | CHEMBL110588
TypeSmall organic molecule
Emp. Form.C34H38N8O6
Mol. Mass.654.7155
SMILESNC(=N)c1ccc2oc(cc2c1)C(=O)N1CCN(CC1)C(=O)CCCCC(=O)N1CCN(CC1)C(=O)c1cc2cc(ccc2o1)C(N)=N