Reaction Details
TargetProthrombin
LigandBDBM50083561
Substrate/Competitorn/a
Meas. Tech.ChEBML_208899
Ki 22000±n/a nM
Citation Ono, SKuwahara, STakeuchi, MSakashita, HNaito, YKondo, T Syntheses and evaluation of amidinobenzofuran derivatives as tryptase inhibitors. Bioorg Med Chem Lett9:3285-90 (2000) Prothrombin
Name:Prothrombin
Type:Protein
Mol. Mass.:70029.57
Organism:Homo sapiens (Human)
Description:P00734
Residue:622
BDBM50083561
NameBDBM50083561
Synonyms:1-{4-[5-amino(imino)methylbenzo[b]thiophen-2-ylcarbonyl]hexahydro-1-pyrazinyl}-2-[4-(2-{4-[5-amino(imino)methylbenzo[b]thiophen-2-ylcarbonyl]hexahydro-1-pyrazinyl}-2-oxoethoxy)phenoxy]-1-ethanone | CHEMBL112240
TypeSmall organic molecule
Emp. Form.C38H38N8O6S2
Mol. Mass.766.888
SMILESNC(=N)c1ccc2sc(cc2c1)C(=O)N1CCN(CC1)C(=O)COc1ccc(OCC(=O)N2CCN(CC2)C(=O)c2cc3cc(ccc3s2)C(N)=N)cc1