Reaction Details
TargetTryptase beta-2/delta/gamma
LigandBDBM50083541
Substrate/Competitorn/a
Meas. Tech.ChEMBL_210823 (CHEMBL811852)
Ki 0.046000±n/a nM
Citation Ono, SKuwahara, STakeuchi, MSakashita, HNaito, YKondo, T Syntheses and evaluation of amidinobenzofuran derivatives as tryptase inhibitors. Bioorg Med Chem Lett9:3285-90 (2000) Tryptase beta-2/delta/gamma
Name:Tryptase beta-2/delta/gamma
Synonyms:Tryptase
Type:n/a
Mol. Mass.:n/a
Description:ASSAY_ID of ChEMBL is 1510505
Components:This complex has 3 components.
Component 1
Name:Tryptase gamma
Type:PROTEIN
Mol. Mass.:33817.52
Organism:Homo sapiens (Human)
Description:ChEMBL_210833
Residue:321
Component 2
Name:Tryptase beta-2
Synonyms:TPS2 TRYB2_HUMAN Tryptase II Tryptase-2
Type:PROTEIN
Mol. Mass.:30518.79
Organism:Homo sapiens (Human)
Description:ChEMBL_210702
Residue:275
Component 3
Name:Tryptase delta
Synonyms:Delta-tryptase Mast cell mMCP-7-like TRYD_HUMAN Tryptase-3
Type:PROTEIN
Mol. Mass.:26578.73
Organism:Homo sapiens (Human)
Description:ChEMBL_104777
Residue:242
BDBM50083541
NameBDBM50083541
Synonyms:1-{4-[5-amino(imino)methyl-4,5,6,7-tetrahydrothieno[3,2-c]pyridin-2-ylcarbonyl]hexahydro-1-pyrazinyl}-2-[4-(2-{4-[5-amino(imino)methyl-4,5,6,7-tetrahydrothieno[3,2-c]pyridin-2-ylcarbonyl]hexahydro-1-pyrazinyl}-2-oxoethoxy)phenoxy]-1-ethanone | CHEMBL112197
TypeSmall organic molecule
Emp. Form.C36H44N10O6S2
Mol. Mass.776.928
SMILESNC(=N)N1CCc2sc(cc2C1)C(=O)N1CCN(CC1)C(=O)COc1ccc(OCC(=O)N2CCN(CC2)C(=O)c2cc3CN(CCc3s2)C(N)=N)cc1