Reaction Details
TargetTryptase beta-2/delta/gamma
LigandBDBM50217305
Substrate/Competitorn/a
Meas. Tech.ChEMBL_210823 (CHEMBL811852)
Ki 460±n/a nM
Citation Ono, SKuwahara, STakeuchi, MSakashita, HNaito, YKondo, T Syntheses and evaluation of amidinobenzofuran derivatives as tryptase inhibitors. Bioorg Med Chem Lett9:3285-90 (2000) Tryptase beta-2/delta/gamma
Name:Tryptase beta-2/delta/gamma
Synonyms:Tryptase
Type:n/a
Mol. Mass.:n/a
Description:ASSAY_ID of ChEMBL is 1510505
Components:This complex has 3 components.
Component 1
Name:Tryptase gamma
Type:PROTEIN
Mol. Mass.:33817.52
Organism:Homo sapiens (Human)
Description:ChEMBL_210833
Residue:321
Component 2
Name:Tryptase beta-2
Synonyms:TPS2 TRYB2_HUMAN Tryptase II Tryptase-2
Type:PROTEIN
Mol. Mass.:30518.79
Organism:Homo sapiens (Human)
Description:ChEMBL_210702
Residue:275
Component 3
Name:Tryptase delta
Synonyms:Delta-tryptase Mast cell mMCP-7-like TRYD_HUMAN Tryptase-3
Type:PROTEIN
Mol. Mass.:26578.73
Organism:Homo sapiens (Human)
Description:ChEMBL_104777
Residue:242
BDBM50217305
NameBDBM50217305
Synonyms:CHEMBL323935
TypeSmall organic molecule
Emp. Form.C29H30N8O5
Mol. Mass.570.5991
SMILESNC(=N)c1ccc2oc(cc2c1)C(=O)N1CCN(CC1)C(=O)N1CCN(CC1)C(=O)c1cc2cc(ccc2o1)C(N)=N