Reaction Details
TargetPeroxisome proliferator-activated receptor gamma
LigandBDBM50083625
Substrate/Competitorn/a
Meas. Tech.ChEMBL_154518 (CHEMBL764404)
EC50 44±n/a nM
Citation Henke, BRAdkison, KKBlanchard, SGLeesnitzer, LMMook, RAPlunket, KDRay, JARoberson, CUnwalla, RWillson, TM Synthesis and biological activity of a novel series of indole-derived PPARgamma agonists. Bioorg Med Chem Lett9:3329-34 (2000) Peroxisome proliferator-activated receptor gamma
Name:Peroxisome proliferator-activated receptor gamma
Type:Nuclear Receptor
Mol. Mass.:57613.46
Organism:Homo sapiens (Human)
Description:P37231
Residue:505
BDBM50083625
NameBDBM50083625
Synonyms:CHEMBL320553 {3-[2-(4-Methoxy-phenyl)-ethyl]-2-phenyl-1H-indol-5-yl}-acetic acid(GW 0207)
TypeSmall organic molecule
Emp. Form.C25H23NO3
Mol. Mass.385.455
SMILESCOc1ccc(CCc2c([nH]c3ccc(CC(O)=O)cc23)-c2ccccc2)cc1