Reaction Details
TargetPeroxisome proliferator-activated receptor gamma
LigandBDBM50217327
Substrate/Competitorn/a
Meas. Tech.ChEMBL_154518 (CHEMBL764404)
EC50 339±n/a nM
Citation Henke, BRAdkison, KKBlanchard, SGLeesnitzer, LMMook, RAPlunket, KDRay, JARoberson, CUnwalla, RWillson, TM Synthesis and biological activity of a novel series of indole-derived PPARgamma agonists. Bioorg Med Chem Lett9:3329-34 (2000) Peroxisome proliferator-activated receptor gamma
Name:Peroxisome proliferator-activated receptor gamma
Type:Nuclear Receptor
Mol. Mass.:57613.46
Organism:Homo sapiens (Human)
Description:P37231
Residue:505
BDBM50217327
NameBDBM50217327
Synonyms:CHEMBL116043
TypeSmall organic molecule
Emp. Form.C24H19F2NO2
Mol. Mass.391.41
SMILESOC(=O)Cc1ccc2[nH]c(c(CCc3ccc(F)cc3)c2c1)-c1ccc(F)cc1