Reaction Details
TargetPeroxisome proliferator-activated receptor gamma
LigandBDBM50217325
Substrate/Competitorn/a
Meas. Tech.ChEMBL_154518 (CHEMBL764404)
EC50<10000±n/a nM
Citation Henke, BRAdkison, KKBlanchard, SGLeesnitzer, LMMook, RAPlunket, KDRay, JARoberson, CUnwalla, RWillson, TM Synthesis and biological activity of a novel series of indole-derived PPARgamma agonists. Bioorg Med Chem Lett9:3329-34 (2000) Peroxisome proliferator-activated receptor gamma
Name:Peroxisome proliferator-activated receptor gamma
Type:Nuclear Receptor
Mol. Mass.:57613.46
Organism:Homo sapiens (Human)
Description:P37231
Residue:505
BDBM50217325
NameBDBM50217325
Synonyms:CHEMBL275682
TypeSmall organic molecule
Emp. Form.C25H23NO3
Mol. Mass.385.455
SMILESCn1c(c(CCc2ccccc2)c2cc(OCC(O)=O)ccc12)-c1ccccc1