Reaction Details
TargetPeroxisome proliferator-activated receptor gamma
LigandBDBM50217328
Substrate/Competitorn/a
Meas. Tech.ChEMBL_154522 (CHEMBL762149)
Ki 3890±n/a nM
Citation Henke, BRAdkison, KKBlanchard, SGLeesnitzer, LMMook, RAPlunket, KDRay, JARoberson, CUnwalla, RWillson, TM Synthesis and biological activity of a novel series of indole-derived PPARgamma agonists. Bioorg Med Chem Lett9:3329-34 (2000) Peroxisome proliferator-activated receptor gamma
Name:Peroxisome proliferator-activated receptor gamma
Type:Nuclear Receptor
Mol. Mass.:57613.46
Organism:Homo sapiens (Human)
Description:P37231
Residue:505
BDBM50217328
NameBDBM50217328
Synonyms:CHEMBL268513
TypeSmall organic molecule
Emp. Form.C19H19NO2
Mol. Mass.293.3597
SMILESCCCc1c([nH]c2ccc(CC(O)=O)cc12)-c1ccccc1