Reaction Details
TargetPeroxisome proliferator-activated receptor gamma
LigandBDBM50217321
Substrate/Competitorn/a
Meas. Tech.ChEMBL_154518 (CHEMBL764404)
EC50 5623±n/a nM
Citation Henke, BRAdkison, KKBlanchard, SGLeesnitzer, LMMook, RAPlunket, KDRay, JARoberson, CUnwalla, RWillson, TM Synthesis and biological activity of a novel series of indole-derived PPARgamma agonists. Bioorg Med Chem Lett9:3329-34 (2000) Peroxisome proliferator-activated receptor gamma
Name:Peroxisome proliferator-activated receptor gamma
Type:Nuclear Receptor
Mol. Mass.:57613.46
Organism:Homo sapiens (Human)
Description:P37231
Residue:505
BDBM50217321
NameBDBM50217321
Synonyms:CHEMBL111841
TypeSmall organic molecule
Emp. Form.C25H23NO2
Mol. Mass.369.4556
SMILESCn1c(c(CCc2ccccc2)c2cc(CC(O)=O)ccc12)-c1ccccc1