Reaction Details
TargetDelta-type opioid receptor
LigandBDBM50083669
Substrate/Competitorn/a
Meas. Tech.ChEBML_53447
Ki 19±n/a nM
Citation Xu, WHuang, LFBauer, LBhargava, HNDunn, WJ Synthesis and opiate receptor binding properties of 17-methyl-6,7-dehydro-3,14-dihydroxy-4,5alpha-epoxy-6,7:4',5'-pyrimidin omorphinans. Bioorg Med Chem Lett9:3375-80 (2000) Delta-type opioid receptor
Name:Delta-type opioid receptor
Type:G Protein-Coupled Receptor (GPCR)
Mol. Mass.:40382.98
Organism:Homo sapiens (Human)
Description:Competition binding assays were carried out using membrane preparations from transfected HN9.10 cells that constitutively expressed the delta opioid receptor.
Residue:372
BDBM50083669
NameBDBM50083669
Synonyms:7-amino-19-methyl-11-oxa-6,8,19-triazahexacyclo[10.9.1.01,10.02,18.04,9.016,22]docosa-4(9),5,7,12,14,16(22)-hexaene-2,13-diol | CHEMBL332947
TypeSmall organic molecule
Emp. Form.C19H20N4O3
Mol. Mass.352.3871
SMILESCN1CCC23C4Oc5c2c(CC1C3(O)Cc1cnc(N)nc41)ccc5O