Reaction Details
TargetIntegrin alpha-IIb/beta-3
LigandBDBM50078714
Substrate/Competitorn/a
Meas. Tech.ChEMBL_218220 (CHEMBL821405)
Ki 9000±n/a nM
Citation Miller, WHAlberts, DPBhatnagar, PKBondinell, WECallahan, JFCalvo, RRCousins, RDErhard, KFHeerding, DAKeenan, RMKwon, CManley, PJNewlander, KARoss, STSamanen, JMUzinskas, INVenslavsky, JWYuan, CCHaltiwanger, RCGowen, MHwang, SMJames, IELark, MWRieman, DJStroup, GBAzzarano, LMSalyers, KLSmith, BRWard, KWJohanson, KOHuffman, WF Discovery of orally active nonpeptide vitronectin receptor antagonists based on a 2-benzazepine Gly-Asp mimetic. J Med Chem43:22-6 (2000) Integrin alpha-IIb/beta-3
Name:Integrin alpha-IIb/beta-3
Synonyms:Glycoprotein IIb/IIIa
Type:n/a
Mol. Mass.:n/a
Description:ASSAY_ID of EBI is 30109
Components:This complex has 2 components.
Component 1
Name:Integrin beta-3
Type:Protein
Mol. Mass.:87038.91
Organism:Homo sapiens (Human)
Description:P05106
Residue:788
Component 2
Name:Integrin alpha-IIb
Synonyms:CD_antigen=CD41 GPIIb Glycoprotein IIb ITGA2B Integrin alpha-IIb heavy chain Integrin alpha-IIb light chain, form 2 Integrin alpha-V/beta-3 and alpha-IIb/beta 3 | Platelet membrane glycoprotein IIb
Type:Protein
Mol. Mass.:113354.85
Organism:Homo sapiens (Human)
Description:P08514
Residue:1039
BDBM50078714
NameBDBM50078714
Synonyms:CHEMBL288493 {(S)-3-[3-(Pyridin-2-ylamino)-propoxy]-10,11-dihydro-5H-dibenzo[a,d]cyclohepten-10-yl}-acetic acid | {3-[3-(Pyridin-2-ylamino)-propoxy]-10,11-dihydro-5H-dibenzo[a,d]cyclohepten-10-yl}-acetic acid
TypeSmall organic molecule
Emp. Form.C25H26N2O3
Mol. Mass.402.4855
SMILESOC(=O)C[C@@H]1Cc2ccc(OCCCNc3ccccn3)cc2Cc2ccccc12