Reaction Details
TargetProthrombin
LigandBDBM50084075
Substrate/Competitorn/a
Meas. Tech.ChEBML_208331
Ki 39±n/a nM
Citation Lu, TSoll, RMIllig, CRBone, RMurphy, LSpurlino, JSalemme, FRTomczuk, BE Structure-activity and crystallographic analysis of a new class of non-amide-based thrombin inhibitor. Bioorg Med Chem Lett10:79-82 (2000) Prothrombin
Name:Prothrombin
Type:Protein
Mol. Mass.:70029.57
Organism:Homo sapiens (Human)
Description:P00734
Residue:622
BDBM50084075
NameBDBM50084075
Synonyms:3-Chloro-benzenesulfonic acid 3-(1-carbamimidoyl-piperidin-4-ylmethoxy)-5-methyl-phenyl ester | CHEMBL352993
TypeSmall organic molecule
Emp. Form.C20H24ClN3O4S
Mol. Mass.437.94
SMILESCc1cc(OCC2CCN(CC2)C(N)=N)cc(OS(=O)(=O)c2cccc(Cl)c2)c1