Reaction Details
TargetProthrombin
LigandBDBM50084081
Substrate/Competitorn/a
Meas. Tech.ChEBML_208331
Ki 36±n/a nM
Citation Lu, TSoll, RMIllig, CRBone, RMurphy, LSpurlino, JSalemme, FRTomczuk, BE Structure-activity and crystallographic analysis of a new class of non-amide-based thrombin inhibitor. Bioorg Med Chem Lett10:79-82 (2000) Prothrombin
Name:Prothrombin
Type:Protein
Mol. Mass.:70029.57
Organism:Homo sapiens (Human)
Description:P00734
Residue:622
BDBM50084081
NameBDBM50084081
Synonyms:CHEMBL166437 | Toluene-3-sulfonic acid 3-(1-carbamimidoyl-piperidin-4-ylmethoxy)-5-methyl-phenyl ester
TypeSmall organic molecule
Emp. Form.C21H27N3O4S
Mol. Mass.417.522
SMILESCc1cccc(c1)S(=O)(=O)Oc1cc(C)cc(OCC2CCN(CC2)C(N)=N)c1