Reaction Details
TargetCarbonic anhydrase 2
LigandBDBM50084561
Substrate/Competitorn/a
Meas. Tech.ChEMBL_45075 (CHEMBL657146)
Ki 2±n/a nM
Citation Scozzafava, ABriganti, FIlies, MASupuran, CT Carbonic anhydrase inhibitors: synthesis of membrane-impermeant low molecular weight sulfonamides possessing in vivo selectivity for the membrane-bound versus cytosolic isozymes. J Med Chem43:292-300 (2000) Carbonic anhydrase 2
Name:Carbonic anhydrase 2
Type:Enzyme
Mol. Mass.:29250.71
Organism:Homo sapiens (Human)
Description:P00918
Residue:260
BDBM50084561
NameBDBM50084561
Synonyms:2,6-Dimethyl-1-{[4-(3-methyl-5-sulfamoyl-3H-[1,3,4]thiadiazol-2-ylidenesulfamoyl)-phenylcarbamoyl]-methyl}-4-phenyl-pyridinium; perchlorate | CHEMBL103630
TypeSmall organic molecule
Emp. Form.C24H25N6O5S3
Mol. Mass.573.687
SMILESCc1cc(cc(C)[n+]1CC(=O)Nc1ccc(cc1)S(=O)(=O)\N=c1\sc(nn1C)S(N)(=O)=O)-c1ccccc1