Reaction Details
TargetSodium-dependent dopamine transporter
LigandBDBM50084718
Substrate/Competitorn/a
Meas. Tech.ChEMBL_62943 (CHEMBL674894)
Ki 10.9±n/a nM
Citation Wang, SSakamuri, SEnyedy, IJKozikowski, APDeschaux, OBandyopadhyay, BCTella, SRZaman, WAJohnson, KM Discovery of a novel dopamine transporter inhibitor, 4-hydroxy-1-methyl-4-(4-methylphenyl)-3-piperidyl 4-methylphenyl ketone, as a potential cocaine antagonist through 3D-database pharmacophore searching. Molecular modeling, structure-activity relationships, and behavioral pharmacological studies. J Med Chem43:351-60 (2000) Sodium-dependent dopamine transporter
Name:Sodium-dependent dopamine transporter
Type:Multi-pass membrane protein
Mol. Mass.:68497.11
Organism:Homo sapiens (Human)
Description:Q01959
Residue:620
BDBM50084718
NameBDBM50084718
Synonyms:(3,4-Dichloro-phenyl)-[4-(3,4-dichloro-phenyl)-4-hydroxy-1-methyl-piperidin-3-yl]-methanone | CHEMBL120490
TypeSmall organic molecule
Emp. Form.C19H17Cl4NO2
Mol. Mass.433.156
SMILESCN1CCC(O)(C(C1)C(=O)c1ccc(Cl)c(Cl)c1)c1ccc(Cl)c(Cl)c1