Reaction Details
TargetKappa-type opioid receptor
LigandBDBM50451119
Substrate/Competitorn/a
Meas. Tech.ChEBML_145849
IC50>10000±n/a nM
Citation Pagé, DMcClory, AMischki, TSchmidt, RButterworth, JSt-Onge, SLabarre, MPayza, KBrown, W Novel Dmt-Tic dipeptide analogues as selective delta-opioid receptor antagonists. Bioorg Med Chem Lett10:167-70 (2000) Kappa-type opioid receptor
Name:Kappa-type opioid receptor
Type:G Protein-Coupled Receptor (GPCR)
Mol. Mass.:42648.76
Organism:Homo sapiens (Human)
Description:P41145
Residue:380
BDBM50451119
NameBDBM50451119
Synonyms:CHEMBL2115427
TypeSmall organic molecule
Emp. Form.C27H27FN2O4
Mol. Mass.462.5127
SMILESCc1cc(O)cc(C)c1C[C@@H](N)C(=O)N1Cc2cc(ccc2C[C@H]1C(O)=O)-c1ccc(F)cc1