Reaction Details
TargetDelta-type opioid receptor
LigandBDBM50451118
Substrate/Competitorn/a
Meas. Tech.ChEBML_147330
IC50 3.8±n/a nM
Citation Pagé, DMcClory, AMischki, TSchmidt, RButterworth, JSt-Onge, SLabarre, MPayza, KBrown, W Novel Dmt-Tic dipeptide analogues as selective delta-opioid receptor antagonists. Bioorg Med Chem Lett10:167-70 (2000) Delta-type opioid receptor
Name:Delta-type opioid receptor
Type:G Protein-Coupled Receptor (GPCR)
Mol. Mass.:40382.98
Organism:Homo sapiens (Human)
Description:Competition binding assays were carried out using membrane preparations from transfected HN9.10 cells that constitutively expressed the delta opioid receptor.
Residue:372
BDBM50451118
NameBDBM50451118
Synonyms:CHEMBL2114978
TypeSmall organic molecule
Emp. Form.C27H27FN2O4
Mol. Mass.462.5127
SMILESCc1cc(O)cc(C)c1C[C@H](N)C(=O)N1Cc2cc(ccc2C[C@H]1C(O)=O)-c1ccc(F)cc1