Reaction Details
TargetDelta-type opioid receptor
LigandBDBM50451122
Substrate/Competitorn/a
Meas. Tech.ChEBML_147330
IC50 571±n/a nM
Citation Pagé, DMcClory, AMischki, TSchmidt, RButterworth, JSt-Onge, SLabarre, MPayza, KBrown, W Novel Dmt-Tic dipeptide analogues as selective delta-opioid receptor antagonists. Bioorg Med Chem Lett10:167-70 (2000) Delta-type opioid receptor
Name:Delta-type opioid receptor
Type:G Protein-Coupled Receptor (GPCR)
Mol. Mass.:40382.98
Organism:Homo sapiens (Human)
Description:Competition binding assays were carried out using membrane preparations from transfected HN9.10 cells that constitutively expressed the delta opioid receptor.
Residue:372
BDBM50451122
NameBDBM50451122
Synonyms:CHEMBL2115430
TypeSmall organic molecule
Emp. Form.C22H24Br2N2O5
Mol. Mass.556.244
SMILESCOc1c(Br)cc2C[C@H](N(Cc2c1Br)C(=O)[C@H](N)Cc1c(C)cc(O)cc1C)C(O)=O