Reaction Details
TargetKappa-type opioid receptor
LigandBDBM50084990
Substrate/Competitorn/a
Meas. Tech.ChEBML_145849
IC50>10000±n/a nM
Citation Pagé, DMcClory, AMischki, TSchmidt, RButterworth, JSt-Onge, SLabarre, MPayza, KBrown, W Novel Dmt-Tic dipeptide analogues as selective delta-opioid receptor antagonists. Bioorg Med Chem Lett10:167-70 (2000) Kappa-type opioid receptor
Name:Kappa-type opioid receptor
Type:G Protein-Coupled Receptor (GPCR)
Mol. Mass.:42648.76
Organism:Homo sapiens (Human)
Description:P41145
Residue:380
BDBM50084990
NameBDBM50084990
Synonyms:(S)-2-[2-Amino-3-(4-hydroxy-2,6-dimethyl-phenyl)-propionyl]-6-(4-fluoro-phenyl)-7-methoxy-1,2,3,4-tetrahydro-isoquinoline-3-carboxylic acid | CHEMBL47564
TypeSmall organic molecule
Emp. Form.C28H29FN2O5
Mol. Mass.492.5387
SMILESCOc1cc2CN([C@@H](Cc2cc1-c1ccc(F)cc1)C(O)=O)C(=O)C(N)Cc1c(C)cc(O)cc1C