Reaction Details
TargetChymotrypsin-like elastase family member 2A
LigandBDBM50085363
Substrate/Competitorn/a
Meas. Tech.ChEBML_152309
IC50 48000±n/a nM
Citation Hayashi, YIijima, KKatada, JKiso, Y Structure-activity relationship studies of chloromethyl ketone derivatives for selective human chymase inhibitors. Bioorg Med Chem Lett10:199-201 (2000) Chymotrypsin-like elastase family member 2A
Name:Chymotrypsin-like elastase family member 2A
Type:PROTEIN
Mol. Mass.:28705.23
Organism:Sus scrofa
Description:ChEMBL_156951
Residue:269
BDBM50085363
NameBDBM50085363
Synonyms:CHEMBL60718 N-Tosyl-L-phenylalanine chloromethyl ketone N-[(2S)-4-chloro-3-oxo-1-phenylbutan-2-yl]-4-methylbenzenesulfonamide Tos-Phe-CH2Cl cid_439647 | l-N-(alpha-(Chloroacetyl)phenethyl)-p-toluenesulfonamide
TypeSmall organic molecule
Emp. Form.C17H18ClNO3S
Mol. Mass.351.848
SMILESCc1ccc(cc1)S(=O)(=O)N[C@@H](Cc1ccccc1)C(=O)CCl