Reaction Details
TargetNeprilysin
LigandBDBM50085455
Substrate/Competitorn/a
Meas. Tech.ChEBML_144612
IC50 290±n/a nM
Citation Robl, JASimpkins, LMAsaad, MM N-formyl hydroxylamine containing dipeptides: generation of a new class of vasopeptidase inhibitors. Bioorg Med Chem Lett10:257-60 (2000) Neprilysin
Name:Neprilysin
Type:Protein
Mol. Mass.:85789.59
Organism:Rattus norvegicus (Rat)
Description:P07861
Residue:750
BDBM50085455
NameBDBM50085455
Synonyms:CHEMBL89760 | {(S)-7-[(R)-2-Benzyl-3-(formyl-hydroxy-amino)-propionylamino]-8-oxo-7,8-dihydro-6H-5-oxa-9-aza-benzocyclohepten-9-yl}-acetic acid
TypeSmall organic molecule
Emp. Form.C22H23N3O7
Mol. Mass.441.4339
SMILESON(C[C@@H](Cc1ccccc1)C(=O)N[C@H]1COc2ccccc2N(CC(O)=O)C1=O)C=O