Reaction Details
TargetAngiotensin-converting enzyme
LigandBDBM50085452
Substrate/Competitorn/a
Meas. Tech.ChEBML_34917
IC50 7±n/a nM
Citation Robl, JASimpkins, LMAsaad, MM N-formyl hydroxylamine containing dipeptides: generation of a new class of vasopeptidase inhibitors. Bioorg Med Chem Lett10:257-60 (2000) Angiotensin-converting enzyme
Name:Angiotensin-converting enzyme
Type:n/a
Mol. Mass.:150405.15
Organism:Oryctolagus cuniculus
Description:n/a
Residue:1310
BDBM50085452
NameBDBM50085452
Synonyms:(S)-2-[((S)-6-Amino-2-methanesulfonylamino-hexanoylamino)-methyl]-3-{1-[(S)-1-carboxy-2-(4-hydroxy-phenyl)-ethylcarbamoyl]-cyclopentyl}-propionic acid Sampatrilat
TypeSmall organic molecule
Emp. Form.C26H40N4O9S
Mol. Mass.584.682
SMILESCS(=O)(=O)N[C@@H](CCCCN)C(=O)NC[C@H](CC1(CCCC1)C(=O)N[C@@H](Cc1ccc(O)cc1)C(O)=O)C(O)=O