Reaction Details
TargetNeprilysin
LigandBDBM50085459
Substrate/Competitorn/a
Meas. Tech.ChEBML_144612
IC50 3±n/a nM
Citation Robl, JASimpkins, LMAsaad, MM N-formyl hydroxylamine containing dipeptides: generation of a new class of vasopeptidase inhibitors. Bioorg Med Chem Lett10:257-60 (2000) Neprilysin
Name:Neprilysin
Type:Protein
Mol. Mass.:85789.59
Organism:Rattus norvegicus (Rat)
Description:P07861
Residue:750
BDBM50085459
NameBDBM50085459
Synonyms:(S)-3-Biphenyl-4-yl-2-[(S)-3-methyl-2-(phosphonomethyl-amino)-butyrylamino]-propionic acid | CHEMBL89563
TypeSmall organic molecule
Emp. Form.C21H27N2O6P
Mol. Mass.434.4226
SMILESCC(C)[C@H](NCP(O)(O)=O)C(=O)N[C@@H](Cc1ccc(cc1)-c1ccccc1)C(O)=O