Reaction Details
TargetProtein farnesyltransferase subunit beta/geranylgeranyltransferase type-1 subunit alpha
LigandBDBM50085469
Substrate/Competitorn/a
Meas. Tech.ChEBML_68472
IC50 0.600000±n/a nM
Citation Ding, CZHunt, JTRicca, CManne, V 3-Imidazolylmethylaminophenylsulfonyltetrahydroquinolines, a novel series of farnesyltransferase inhibitors. Bioorg Med Chem Lett10:273-5 (2000) Protein farnesyltransferase subunit beta/geranylgeranyltransferase type-1 subunit alpha
Name:Protein farnesyltransferase subunit beta/geranylgeranyltransferase type-1 subunit alpha
Type:Protein Complex
Mol. Mass.:n/a
Description:To express recombinant enzyme in E. coli, the cloned human alpha and beta subunits were co-expressed from a plasmid, in which their expression was translationally coupled.
Components:This complex has 2 components.
Component 1
Name:Protein farnesyltransferase subunit beta
Synonyms:CAAX farnesyltransferase subunit alpha FNTB FTase-alpha GGTase-I-alpha Protein farnesyl/geranylgeranyl transferase Protein farnesyltransferase subunit beta Protein farnesyltransferase/geranylgeranyltransferase type-1 subunit alpha Ras proteins prenyltransferase subunit beta | Type I protein geranyl-geranyltransferase subunit alpha
Type:Enzyme Subunit
Mol. Mass.:48766.02
Organism:Homo sapiens (Human)
Description:Protein farnesyltransferase subunit beta
Residue:437
Component 2
Name:Protein farnesyltransferase/geranylgeranyltransferase type-1 subunit alpha
Synonyms:CAAX farnesyltransferase alpha subunit FNTA_HUMAN FTase-alpha Geranylgeranyl Transferase (GGTase-I) Chain A Protein Farnesyltransferase (PFT) Chain A Protein farnesyltransferase Protein farnesyltransferase/geranylgeranyltransferase type I alpha subunit | Ras proteins prenyltransferase alpha
Type:Enzyme
Mol. Mass.:44392.46
Organism:Homo sapiens (Human)
Description:Recombinant human FTase.
Residue:379
BDBM50085469
NameBDBM50085469
Synonyms:(S)-2-({2-[(S)-2-((R)-2-Amino-3-mercapto-propylamino)-3-methyl-butyryl]-1,2,3,4-tetrahydro-isoquinoline-3-carbonyl}-amino)-4-methylsulfanyl-butyric acid | CHEMBL328773
TypeSmall organic molecule
Emp. Form.C23H36N4O4S2
Mol. Mass.496.686
SMILESCSCC[C@H](NC(=O)[C@@H]1Cc2ccccc2CN1C(=O)[C@@H](NC[C@@H](N)CS)C(C)C)C(O)=O