Reaction Details
TargetLeukocyte surface antigen CD47
LigandBDBM50192012
Substrate/Competitorn/a
Meas. Tech.ChEMBL_1912518 (CHEMBL4415101)
Kd 43000±n/a nM
Citation Denèfle, TPramil, EGómez-Morales, LLevasseur, MDLardé, ENewton, CHerry, KHerbi, LLamotte, YOdile, EAncellin, NGrondin, PMartinez-Torres, ACViviani, FMerle-Beral, HLequin, OSusin, SAKaroyan, P Homotrimerization Approach in the Design of Thrombospondin-1 Mimetic Peptides with Improved Potency in Triggering Regulated Cell Death of Cancer Cells. J Med Chem62:7656-7668 (2019) 
 
Leukocyte surface antigen CD47
Name:Leukocyte surface antigen CD47
Type:PROTEIN
Mol. Mass.:35214.74
Organism:Homo sapiens (Human)
Description:ChEMBL_116544
Residue:323
BDBM50192012
NameBDBM50192012
Synonyms:CHEMBL3971661
TypeSmall organic molecule
Emp. Form.C68H105N17O12S
Mol. Mass.1384.733
SMILESCSCC[C@H](NC(=O)[C@@H](NC(=O)[C@@H](NC(=O)[C@H](Cc1ccc(O)cc1)NC(=O)[C@H](Cc1ccccc1)NC(=O)[C@H](CCCNC(N)=N)NC(=O)[C@H](N)CCCCN)C(C)C)C(C)C)C(=O)N[C@@H](Cc1c[nH]c2ccccc12)C(=O)N[C@@H](CCCCN)C(=O)N[C@H](CCCCN)C(O)=O