Reaction Details
TargetAlpha-2B adrenergic receptor
LigandBDBM50085680
Substrate/Competitorn/a
Meas. Tech.ChEMBL_33358 (CHEMBL644762)
Ki 621±n/a nM
Citation Ross, TMJetter, MCMcDonnell, MEBoyd, REConnelly, CDMartinez, RPLewis, MACodd, EERaffa, RBReitz, AB alpha(2) Adrenoceptor agonists as potential analgesic agents. 2. Discovery of 4-(4-Imidazo)-1,3-dimethyl-6,7-dihydrothianaphthene [corrected] as a high-affinity ligand for the alpha(2D) adrenergic receptor. J Med Chem43:765-8 (2000) Alpha-2B adrenergic receptor
Name:Alpha-2B adrenergic receptor
Type:Enzyme
Mol. Mass.:49964.20
Organism:Homo sapiens (Human)
Description:P18089
Residue:450
BDBM50085680
NameBDBM50085680
Synonyms:4-(6,7-Dihydro-benzo[b]thiophen-4-yl)-1H-imidazole | CHEMBL286246
TypeSmall organic molecule
Emp. Form.C11H10N2S
Mol. Mass.202.276
SMILESC1Cc2sccc2C(=C1)c1cnc[nH]1