Reaction Details
TargetAlpha-2B adrenergic receptor
LigandBDBM50085678
Substrate/Competitorn/a
Meas. Tech.ChEMBL_33358 (CHEMBL644762)
Ki 99±n/a nM
Citation Ross, TMJetter, MCMcDonnell, MEBoyd, REConnelly, CDMartinez, RPLewis, MACodd, EERaffa, RBReitz, AB alpha(2) Adrenoceptor agonists as potential analgesic agents. 2. Discovery of 4-(4-Imidazo)-1,3-dimethyl-6,7-dihydrothianaphthene [corrected] as a high-affinity ligand for the alpha(2D) adrenergic receptor. J Med Chem43:765-8 (2000) Alpha-2B adrenergic receptor
Name:Alpha-2B adrenergic receptor
Type:Enzyme
Mol. Mass.:49964.20
Organism:Homo sapiens (Human)
Description:P18089
Residue:450
BDBM50085678
NameBDBM50085678
Synonyms:4-(4,5,6,7-Tetrahydro-benzo[b]thiophen-4-yl)-1H-imidazole | CHEMBL284213
TypeSmall organic molecule
Emp. Form.C11H12N2S
Mol. Mass.204.291
SMILESC1CC(c2cnc[nH]2)c2ccsc2C1