Reaction Details
TargetAlpha-2C adrenergic receptor
LigandBDBM50085677
Substrate/Competitorn/a
Meas. Tech.ChEMBL_33536 (CHEMBL873182)
Ki 26±n/a nM
Citation Ross, TMJetter, MCMcDonnell, MEBoyd, REConnelly, CDMartinez, RPLewis, MACodd, EERaffa, RBReitz, AB alpha(2) Adrenoceptor agonists as potential analgesic agents. 2. Discovery of 4-(4-Imidazo)-1,3-dimethyl-6,7-dihydrothianaphthene [corrected] as a high-affinity ligand for the alpha(2D) adrenergic receptor. J Med Chem43:765-8 (2000) Alpha-2C adrenergic receptor
Name:Alpha-2C adrenergic receptor
Type:Enzyme
Mol. Mass.:49552.32
Organism:Homo sapiens (Human)
Description:P18825
Residue:462
BDBM50085677
NameBDBM50085677
Synonyms:4-(1,3-Dimethyl-6,7-dihydro-benzo[c]thiophen-4-yl)-1H-imidazole | CHEMBL284795
TypeSmall organic molecule
Emp. Form.C13H14N2S
Mol. Mass.230.329
SMILESCc1sc(C)c2c1CCC=C2c1cnc[nH]1