Reaction Details
TargetAlpha-2A adrenergic receptor [16-465]
LigandBDBM50085682
Substrate/Competitorn/a
Meas. Tech.ChEMBL_33680 (CHEMBL646821)
Ki 3±n/a nM
Citation Ross, TMJetter, MCMcDonnell, MEBoyd, REConnelly, CDMartinez, RPLewis, MACodd, EERaffa, RBReitz, AB alpha(2) Adrenoceptor agonists as potential analgesic agents. 2. Discovery of 4-(4-Imidazo)-1,3-dimethyl-6,7-dihydrothianaphthene [corrected] as a high-affinity ligand for the alpha(2D) adrenergic receptor. J Med Chem43:765-8 (2000) Alpha-2A adrenergic receptor [16-465]
Name:Alpha-2A adrenergic receptor [16-465]
Type:G-protein coupled receptor
Mol. Mass.:48961.69
Organism:Rattus norvegicus (rat)
Description:P22909[16-465]
Residue:450
BDBM50085682
NameBDBM50085682
Synonyms:4-(4,5-Dihydro-benzo[b]thiophen-7-yl)-1H-imidazole | CHEMBL30955
TypeSmall organic molecule
Emp. Form.C11H10N2S
Mol. Mass.202.276
SMILESC1Cc2ccsc2C(=C1)c1cnc[nH]1