Reaction Details
TargetAlpha-2A adrenergic receptor
LigandBDBM50085681
Substrate/Competitorn/a
Meas. Tech.ChEMBL_33079 (CHEMBL647726)
Ki 277±n/a nM
Citation Ross, TMJetter, MCMcDonnell, MEBoyd, REConnelly, CDMartinez, RPLewis, MACodd, EERaffa, RBReitz, AB alpha(2) Adrenoceptor agonists as potential analgesic agents. 2. Discovery of 4-(4-Imidazo)-1,3-dimethyl-6,7-dihydrothianaphthene [corrected] as a high-affinity ligand for the alpha(2D) adrenergic receptor. J Med Chem43:765-8 (2000) Alpha-2A adrenergic receptor
Name:Alpha-2A adrenergic receptor
Type:Enzyme
Mol. Mass.:48979.91
Organism:Homo sapiens (Human)
Description:P08913
Residue:465
BDBM50085681
NameBDBM50085681
Synonyms:4-Benzo[b]thiophen-4-yl-1H-imidazole | CHEMBL30534
TypeSmall organic molecule
Emp. Form.C11H8N2S
Mol. Mass.200.26
SMILESc1cc2c(cccc2s1)-c1c[nH]cn1