Reaction Details
TargetProtein kinase C alpha type
LigandBDBM50085884
Substrate/Competitorn/a
Meas. Tech.ChEMBL_161416 (CHEMBL766516)
Ki 11±n/a nM
Citation Nacro, KBienfait, BLee, JHan, KCKang, JHBenzaria, SLewin, NEBhattacharyya, DKBlumberg, PMMarquez, VE Conformationally constrained analogues of diacylglycerol (DAG). 16. How much structural complexity is necessary for recognition and high binding affinity to protein kinase C? J Med Chem43:921-44 (2000) Protein kinase C alpha type
Name:Protein kinase C alpha type
Type:Enzyme
Mol. Mass.:76755.65
Organism:Homo sapiens (Human)
Description:The recombinant human PKC enzymes were produced using a baculovirus expression system in SF9 cells
Residue:672
BDBM50085884
NameBDBM50085884
Synonyms:3-(2-Hydroxymethyl-4-octadec-9-enylidene-5-oxo-tetrahydro-furan-2-yl)-acrylic acid methyl ester | CHEMBL170120
TypeSmall organic molecule
Emp. Form.C27H44O5
Mol. Mass.448.6353
SMILESCCCCCCCC\C=C/CCCCCCC\C=C1\C[C@](CO)(OC1=O)\C=C\C(=O)OC