Reaction Details
TargetProtein kinase C alpha type
LigandBDBM50085880
Substrate/Competitorn/a
Meas. Tech.ChEMBL_161416 (CHEMBL766516)
Ki 2.7±n/a nM
Citation Nacro, KBienfait, BLee, JHan, KCKang, JHBenzaria, SLewin, NEBhattacharyya, DKBlumberg, PMMarquez, VE Conformationally constrained analogues of diacylglycerol (DAG). 16. How much structural complexity is necessary for recognition and high binding affinity to protein kinase C? J Med Chem43:921-44 (2000) Protein kinase C alpha type
Name:Protein kinase C alpha type
Type:Enzyme
Mol. Mass.:76755.65
Organism:Homo sapiens (Human)
Description:The recombinant human PKC enzymes were produced using a baculovirus expression system in SF9 cells
Residue:672
BDBM50085880
NameBDBM50085880
Synonyms:3-Isopropyl-4-methyl-pentanoic acid 2-hydroxymethyl-4-(3-isopropyl-4-methyl-pentylidene)-5-oxo-tetrahydro-furan-2-ylmethyl ester | CHEMBL137288
TypeSmall organic molecule
Emp. Form.C24H42O5
Mol. Mass.410.5873
SMILESCC(C)C(C\C=C1/CC(CO)(COC(=O)CC(C(C)C)C(C)C)OC1=O)C(C)C