Reaction Details
TargetProtein kinase C alpha type
LigandBDBM50085903
Substrate/Competitorn/a
Meas. Tech.ChEMBL_161416 (CHEMBL766516)
Ki 20±n/a nM
Citation Nacro, KBienfait, BLee, JHan, KCKang, JHBenzaria, SLewin, NEBhattacharyya, DKBlumberg, PMMarquez, VE Conformationally constrained analogues of diacylglycerol (DAG). 16. How much structural complexity is necessary for recognition and high binding affinity to protein kinase C? J Med Chem43:921-44 (2000) Protein kinase C alpha type
Name:Protein kinase C alpha type
Type:Enzyme
Mol. Mass.:76755.65
Organism:Homo sapiens (Human)
Description:The recombinant human PKC enzymes were produced using a baculovirus expression system in SF9 cells
Residue:672
BDBM50085903
NameBDBM50085903
Synonyms:3-(4-Heptadec-9-enylidene-2-hydroxymethyl-5-oxo-tetrahydro-furan-2-yl)-acrylic acid methyl ester | CHEMBL173130
TypeSmall organic molecule
Emp. Form.C26H42O5
Mol. Mass.434.6087
SMILESCCCCCCC\C=C/CCCCCCC\C=C1/C[C@](CO)(OC1=O)\C=C\C(=O)OC