Reaction Details
TargetProtein kinase C alpha type
LigandBDBM50085891
Substrate/Competitorn/a
Meas. Tech.ChEMBL_161416 (CHEMBL766516)
Ki 8.4±n/a nM
Citation Nacro, KBienfait, BLee, JHan, KCKang, JHBenzaria, SLewin, NEBhattacharyya, DKBlumberg, PMMarquez, VE Conformationally constrained analogues of diacylglycerol (DAG). 16. How much structural complexity is necessary for recognition and high binding affinity to protein kinase C? J Med Chem43:921-44 (2000) Protein kinase C alpha type
Name:Protein kinase C alpha type
Type:Enzyme
Mol. Mass.:76755.65
Organism:Homo sapiens (Human)
Description:The recombinant human PKC enzymes were produced using a baculovirus expression system in SF9 cells
Residue:672
BDBM50085891
NameBDBM50085891
Synonyms:CHEMBL173821 | Hexanoic acid 2-hydroxymethyl-4-(3-isopropyl-4-methyl-pent-2-enylidene)-5-oxo-tetrahydro-furan-2-ylmethyl ester
TypeSmall organic molecule
Emp. Form.C21H34O5
Mol. Mass.366.4917
SMILES[#6]-[#6]-[#6]-[#6]-[#6]-[#6](=O)-[#8]-[#6]C1([#6]-[#8])[#6]\[#6](=[#6]/[#6]=[#6](/[#6](-[#6])-[#6])-[#6](-[#6])-[#6])-[#6](=O)-[#8]1