Reaction Details
TargetAdenosine receptor A2a
LigandBDBM21190
Substrate/Competitorn/a
Meas. Tech.ChEMBL_1913501 (CHEMBL4416084)
Ki 1.9±n/a nM
Citation Mallo-Abreu, AMajellaro, MJespers, WAzuaje, JCaamaño, OGarcía-Mera, XBrea, JMLoza, MIGutiérrez-de-Terán, HSotelo, E Trifluorinated Pyrimidine-Based A J Med Chem62:9315-9330 (2019) 
 
Adenosine receptor A2a
Name:Adenosine receptor A2a
Type:G Protein-Coupled Receptor (GPCR)
Mol. Mass.:44716.46
Organism:Homo sapiens (Human)
Description:P29274
Residue:412
BDBM21190
NameBDBM21190
Synonyms:4-(2-{[5-amino-2-(furan-2-yl)-[1,2,4]triazolo[1,5-a][1,3,5]triazin-7-yl]amino}ethyl)phenol ZM 241385 [3H]-ZM241385
TypeSmall organic molecule
Emp. Form.C16H15N7O2
Mol. Mass.337.336
SMILESNc1nc(NCCc2ccc(O)cc2)nc2nc(nn12)-c1ccco1