Reaction Details
TargetAdenosine receptor A2b
LigandBDBM50268107
Substrate/Competitorn/a
Meas. Tech.ChEMBL_1913503 (CHEMBL4416086)
Ki 0.500000±n/a nM
Citation Mallo-Abreu, AMajellaro, MJespers, WAzuaje, JCaamaño, OGarcía-Mera, XBrea, JMLoza, MIGutiérrez-de-Terán, HSotelo, E Trifluorinated Pyrimidine-Based A J Med Chem62:9315-9330 (2019) 
 
Adenosine receptor A2b
Name:Adenosine receptor A2b
Type:G Protein-Coupled Receptor (GPCR)
Mol. Mass.:36341.22
Organism:Homo sapiens (Human)
Description:n/a
Residue:332
BDBM50268107
NameBDBM50268107
Synonyms:CHEMBL485862 N-(2-(2-phenyl-6-(4-(3-phenylpropyl)piperazine-1-carbonyl)-7H-pyrrolo[2,3-d]pyrimidin-4-ylamino)ethyl)acetamide | OSIP-339391
TypeSmall organic molecule
Emp. Form.C30H35N7O2
Mol. Mass.525.6446
SMILESCC(=O)NCCNc1nc(nc2[nH]c(cc12)C(=O)N1CCN(CCCc2ccccc2)CC1)-c1ccccc1