Reaction Details
Target5-hydroxytryptamine receptor 2B
LigandBDBM50086059
Substrate/Competitorn/a
Meas. Tech.ChEMBL_2886 (CHEMBL617788)
Ki 10±n/a nM
Citation Bromidge, SMDabbs, SDavies, DTDavies, SDuckworth, DMForbes, ITGaster, LMHam, PJones, GEKing, FDMulholland, KRSaunders, DVWyman, PABlaney, FEClarke, SEBlackburn, TPHolland, VKennett, GALightowler, SMiddlemiss, DNTrail, BRiley, GJWood, MD Biarylcarbamoylindolines are novel and selective 5-HT(2C) receptor inverse agonists: identification of 5-methyl-1-[[2-[(2-methyl-3-pyridyl)oxy]- 5-pyridyl]carbamoyl]-6-trifluoromethylindoline (SB-243213) as a potential antidepressant/anxiolytic agent. J Med Chem43:1123-34 (2000) 5-hydroxytryptamine receptor 2B
Name:5-hydroxytryptamine receptor 2B
Type:G Protein-Coupled Receptor (GPCR)
Mol. Mass.:54312.47
Organism:Homo sapiens (Human)
Description:Receptor binding assays were performed using human clone stably expressed in CHO cells.
Residue:481
BDBM50086059
NameBDBM50086059
Synonyms:5-Methoxy-6-trifluoromethyl-2,3-dihydro-indole-1-carboxylic acid [3,4']bipyridinyl-5-ylamide | CHEMBL14863
TypeSmall organic molecule
Emp. Form.C21H17F3N4O2
Mol. Mass.414.3805
SMILESCOc1cc2CCN(C(=O)Nc3cncc(c3)-c3ccncc3)c2cc1C(F)(F)F