Reaction Details
Target5-hydroxytryptamine receptor 2C
LigandBDBM50086055
Substrate/Competitorn/a
Meas. Tech.ChEMBL_2757 (CHEMBL617754)
Ki 0.63±n/a nM
Citation Bromidge, SMDabbs, SDavies, DTDavies, SDuckworth, DMForbes, ITGaster, LMHam, PJones, GEKing, FDMulholland, KRSaunders, DVWyman, PABlaney, FEClarke, SEBlackburn, TPHolland, VKennett, GALightowler, SMiddlemiss, DNTrail, BRiley, GJWood, MD Biarylcarbamoylindolines are novel and selective 5-HT(2C) receptor inverse agonists: identification of 5-methyl-1-[[2-[(2-methyl-3-pyridyl)oxy]- 5-pyridyl]carbamoyl]-6-trifluoromethylindoline (SB-243213) as a potential antidepressant/anxiolytic agent. J Med Chem43:1123-34 (2000) 5-hydroxytryptamine receptor 2C
Name:5-hydroxytryptamine receptor 2C
Type:G Protein-Coupled Receptor (GPCR)
Mol. Mass.:51836.79
Organism:Homo sapiens (Human)
Description:P28335
Residue:458
BDBM50086055
NameBDBM50086055
Synonyms:5-Methoxy-6-trifluoromethyl-2,3-dihydro-indole-1-carboxylic acid (3-ethyl-5-pyridin-3-yl-phenyl)-amide | CHEMBL416896
TypeSmall organic molecule
Emp. Form.C24H22F3N3O2
Mol. Mass.441.4456
SMILESCCc1cc(NC(=O)N2CCc3cc(OC)c(cc23)C(F)(F)F)cc(c1)-c1cccnc1